{"text_format":"3","workbook":"xlsx","n_sheets":8,"sheets":["Ber","Geg","Contr conc","Standaardconstr","Vergelijk tbv brochure","Decker","Gesch","Sheet1"],"not_rendered":{"images":3,"defined_names":1},"read":"whole","date_system":"1900"}

{"sheet":"Ber","index":0,"n_rows":78,"n_cols":12,"rows_kept":78,"merged":[[6,3,6,10],[7,3,7,10],[8,3,8,10]]}
[2]
[]
[null,null,{"$f":"IF(A78=1,Geg!B166,Geg!I166)","v":"Berekening R en U waarden spouwmuurconstructies "}]
[null,null,{"$f":"IF(A78=1,Geg!B167,Geg!I167)","v":"conform STS 08.82 en Butgb-informatieblad "}]
[null,null,{"$f":"IF(A78=1,Geg!B168,Geg!I168)","v":"\"Geïsoleerde spouwmuren met gevelmetselwerk\" "}]
[]
[null,null,"PROJECT:  "]
[null,null,{"$f":"IF(A78=1,Geg!B171,Geg!I171)","v":"Aanvrager:  "}]
[null,null,{"$f":"IF(A78=1,Geg!B172,Geg!I172)","v":"Onderdeel:  "}]
[]
[]
[null,null,{"$f":"IF(A78=1,Geg!B175,Geg!I175)","v":"Uitgangspunten:"}]
[null,null,{"$f":"IF(A$78=1,Geg!B176,Geg!I176)","v":"Buitenspouwblad"},{"$nulls":4},{"$f":"IF(A78=1,Geg!F176,Geg!M176)","v":"Baksteen"},null,null,100,{"$f":"Geg!D43","v":90}]
[null,null,{"$f":"IF(A$78=1,Geg!B177,Geg!I177)","v":"Luchtspouw"}]
[null,null,{"$f":"IF(A$78=1,Geg!B178,Geg!I178)","v":"Isolatie"},{"$nulls":4},"PolyFort+"]
[null,null,{"$f":"IF(A$78=1,Geg!B179,Geg!I179)","v":"Soort en aantal bevestigers"},{"$nulls":7},100]
[null,null,{"$f":"IF(A$78=1,Geg!B180,Geg!I180)","v":"Binnenspouwblad"},{"$nulls":7},100,{"$f":"IF(D58=9,90,IF(D58=11,90,IF(D58=13,90,140)))","v":140}]
[null,null,{"$f":"IF(A$78=1,Geg!B181,Geg!I181)","v":"Pleisterlaag"},{"$nulls":4},{"$f":"IF(A78=1,Geg!F181,Geg!M181)","v":"Gipspleister"}]
[]
[{"$nulls":7},"UC =",null,{"$f":"K71","v":{"v":0.15213930255547414,"d":"0.15"}},"W/m²K"]
[{"$nulls":7},"RD =",null,{"$f":"FLOOR(K57,0.05)","v":{"v":6.300000000000001,"d":"6.30"}},"m²K/W"]
[{"$nulls":7},"RC =",null,{"$f":"K72","v":{"v":6.402923519452659,"d":"6.40"}},"m²K/W"]
[]
[null,null,{"$f":"IF(A78=1,Geg!B184,Geg!K184)","v":"Aan de uitkomsten van dit programma kunnen geen rechten bij IsoBouw Systems bv worden ontleend. Een "}]
[null,null,{"$f":"IF(A78=1,Geg!B185,Geg!K185)","v":"herberekening conform dit programma is door IsoBouw Systems bv mogelijk. Dit programma is intellectueel "}]
[null,null,{"$f":"IF(A78=1,Geg!B186,Geg!K186)","v":"eigendom van IsoBouw Systems bv en mag als zodanig niet worden aangepast op welke wijze dan ook. ©"}]
[null,null,{"$f":"IF(A78=1,\"\",Geg!K187)","v":""}]
{"$rows_empty":24}
[{"$nulls":3},"nr",null,"d","l","aant","A",null,"R"]
[{"$nulls":5},"m","W/mK",null,"m²",null,"m²K/W"]
["Rse =",{"$nulls":9},{"$f":"Geg!F36","v":0.04}]
["Buitenspouwblad =",{"$nulls":3},1,{"$f":"L13/1000","v":0.09},{"$f":"VLOOKUP(E55,Geg!A43:F43,6)","v":1.31},{"$nulls":3},{"$f":"F55/G55","v":{"v":0.06870229007633587,"d":"0.0687"}}]
["Luchtspouw =",null,null,3,{"$nulls":4},"*",null,{"$f":"VLOOKUP(D56,Geg!A47:F49,6)","v":0.09}]
["Isolatie =",null,null,1,5,{"$f":"VLOOKUP(E57,Geg!A86:D95,4)/1000","v":0.196},0.031,{"$nulls":3},{"$f":"F57/G57","v":{"v":6.322580645161291,"d":"6.3226"}}]
["Binnenspouwblad =",null,null,7,null,{"$f":"VLOOKUP(D58,Geg!A53:D67,4)/1000","v":0.14},{"$f":"VLOOKUP(D58,Geg!A53:E67,5)","v":0.7},{"$nulls":3},{"$f":"F58/G58","v":{"v":0.20000000000000004,"d":"0.2000"}}]
["Pleisterwerk =",{"$nulls":3},2,{"$f":"VLOOKUP(E59,Geg!A71:D73,4)/1000","v":{"v":0.01,"d":"0.010"}},{"$f":"VLOOKUP(E59,Geg!A71:F73,6)","v":0.52},{"$nulls":3},{"$f":"F59/G59","v":{"v":0.019230769230769232,"d":"0.0192"}}]
["Rsi =",{"$nulls":9},{"$f":"Geg!F37","v":0.13}]
["Rcorr =  ",{"$nulls":9},{"$f":"Geg!E26","v":{"v":-0.1,"d":"-0.10"}}]
["Rtot = ",null,"Rtot = Rsi + SRm + Risol + Rse + Rcorr  ",{"$nulls":7},{"$f":"SUM(K54:K61)","v":{"v":6.770513704468397,"d":"6.771"}}]
["U =",null,"U = 1/Rtot",{"$nulls":7},{"$f":"1/K62","v":0.14769928009155658}]
["a =",{"$nulls":8},{"$f":"Geg!E38","v":0.8}]
["lf =",null,null,1,null,null,{"$f":"VLOOKUP(D65,Geg!A121:E125,5)","v":15}]
["Af =",null,null,6,null,null," ",null,{"$f":"VLOOKUP(D65,Geg!A121:F125,6)","v":1.386e-05}]
["nf =",{"$nulls":6},{"$f":"VLOOKUP(D66,Geg!A128:B134,2)","v":6}]
["di =",{"$nulls":4},{"$f":"F57","v":0.196}]
["DUg =",{"$nulls":8},0]
["DUf =","a*((lf*Af*nf)/di)*(Risol/Rtot)²",{"$nulls":8},{"$f":"J64*((G65*I66*H67)/F68)*(K57/K62)*(K57/K62)","v":0.004440022463917549}]
["Uc = ",null,"U + DUg + DUf",{"$nulls":7},{"$f":"K63+K69+K70","v":0.15213930255547414}]
["RC =",{"$nulls":9},{"$f":"(1/K71)-(K54+K60)","v":{"v":6.402923519452659,"d":"6.40"}}]
[]
[]
[]
[]
[]
[1]

{"sheet":"Geg","index":1,"n_rows":187,"n_cols":14,"rows_kept":187,"hidden":true}
["Berekeningsgrondslagen"]
[]
["Bepaling Rtot van een spouwmuurconstructie conform"]
["STS 08.82 Materialen voor thermische isolatie"]
["Butgb-informatieblad Geïsoleerde spouwmuren met gevelmetselwerk "]
[]
["Rtot = Rsi + SRm + Risol + Rse + Rcorr  ",{"$nulls":4},"m²K/W"]
["U = 1/Rtot",{"$nulls":4},"W/m²K"]
["Uc = U + DUg + DUf",{"$nulls":4},"W/m²K"]
["Rtot = ","thermische weerstand van de spouwmuur"]
["Rsi =","overgangsweerstand binnenzijde"]
["SRm =","totaal van alle Rrekenwaarden van de iverse lagen exclusief isolatielaag "]
["Risol =",null,"gedeclareerde thermische weerstand van de homogene isolatielaag"]
["Rse =","overgangsweerstand buitenzijde"]
["Rcorr =  ","correctiefactor voor plaatsingstoleranties"]
["U =","warmtedoorgangscoëfficiënt"]
["Uc = ","gecorrigeerde wamtedoorgangscoëfficiënt conform EN 6946"]
["DUg =","toeslag voor spleten in isolatielaag"]
["DUf =","toeslag voor bevestigingenspleten in isolatielaag"]
[{"$nulls":6},"bron:"]
["Rsi =",{"$nulls":3},0.13,"m²K/W","EN 6946"]
["Rluchtspouw (niet geventileerd) =",null,null,"30 mm",0.18,"m²K/W","Butgb informatieblad"]
["Rluchtspouw (zwak geventileerd) =",null,null,"30 mm",0.09,"m²K/W","Butgb informatieblad"]
["Risol =","RD",{"$nulls":4},"Butgb informatieblad"]
["Rse =",{"$nulls":3},0.04,"m²K/W","EN 6946"]
["Rcorr =  ",{"$nulls":3},{"v":-0.1,"d":"-0.10"},"m²K/W","Butgb informatieblad"]
["DUg =",{"$nulls":5},"EN 6946, of = 0 als uitvoering conform ATG, anders conform EN 6946"]
["DUf =","a*((lf*Af*nf)/di)*(Risol/Rtot)²",{"$nulls":3},"W/m²K","EN 6946"]
[null,"a =","coëfficiënt =",null,0.8,{"$nulls":7}," "]
[null,"lf =","l bevestiger"]
[null,"Af =","oppervlakte doorsnede bevestiger"]
[null,"nf =","aantal bevestiger per m²"]
[null,"di =","lengte van de bevestiger"]
[]
["Factoren",{"$nulls":4},"m²K/W"]
[null,"Rse",{"$nulls":3},0.04,"Bron: EN 6946"]
[null,"Rsi",{"$nulls":3},0.13,"Bron: EN 6946"]
[null,"a",null,null,0.8,null,"Bron: Butgb"]
[null,"Dug",null,null,0,null,"Bron: EN 6946"]
[]
["Buitenspouwblad",null,null,"d",null,"l","Rm"]
[{"$nulls":3},"mm",null,"W/mK","m²K/W"]
[1,"Baksteen",null,90,"90 mm",1.31,{"$f":"(D43/1000)/F43","v":{"v":0.06870229007633587,"d":"0.0687"}},"Bron: Butgb"]
[]
["Luchtspouw",{"$nulls":4},"Rm"]
[{"$nulls":5},"m²K/W",{"$nulls":3},"Ned",{"$nulls":3},"Frans"]
[1,{"$f":"IF(Ber!A$78=1,Geg!J47,Geg!N47)","v":"Luchtspouw < 30 mm"},{"$nulls":3},0,"Bron: Butgb",null,null,"Luchtspouw < 30 mm",{"$nulls":3},"Creux < 30 mm"]
[2,{"$f":"IF(Ber!A$78=1,Geg!J48,Geg!N48)","v":"Luchtspouw, niet geventileerd, 30 mm"},{"$nulls":3},0.18,"Bron: Butgb",null,null,"Luchtspouw, niet geventileerd, 30 mm",{"$nulls":3},"Creux, non ventilé, 30 mm"]
[3,{"$f":"IF(Ber!A$78=1,Geg!J49,Geg!N49)","v":"Luchtspouw, zwak geventileerd, 30 mm"},{"$nulls":3},0.09,"Bron: Butgb",null,null,"Luchtspouw, zwak geventileerd, 30 mm",{"$nulls":3},"Creux, ventilé moyènnement, 30 mm"]
[]
["Binnenspouwblad",null,null,"d","l","Rm"]
[{"$nulls":3},"mm","W/mK","m²K/W",{"$nulls":3},"Ned",{"$nulls":3},"Frans"]
[1,{"$f":"IF(Ber!A$78=1,Geg!J53,Geg!N53)","v":"Betonblokken lambda = 1,27 W/mK"},null,140,1.27,{"$f":"(D53/1000)/E53","v":{"v":0.11023622047244096,"d":"0.1102"}},"Bron: Porotherm",null,null,"Betonblokken lambda = 1,27 W/mK",{"$nulls":3},"Blocs de béton lambda = 1,27 W/mK"]
[2,{"$f":"IF(Ber!A$78=1,Geg!J54,Geg!N54)","v":"Betonblokken lambda = 1,36 W/mK"},null,140,1.36,{"v":0.10294117647058824,"d":"0.1029"},"Bron: Porotherm",null,null,"Betonblokken lambda = 1,36 W/mK",{"$nulls":3},"Blocs de béton lambda = 1,36 W/mK"]
[3,{"$f":"IF(Ber!A$78=1,Geg!J55,Geg!N55)","v":"Cellenbeton lambda = 0,10 W/mK"},null,140,0.1,{"v":1.4000000000000001,"d":"1.4000"},"Bron: Porotherm",null,null,"Cellenbeton lambda = 0,10 W/mK",{"$nulls":3},"Béton cellulaire lambda = 0,10 W/mK"]
[4,{"$f":"IF(Ber!A$78=1,Geg!J56,Geg!N56)","v":"Cellenbeton lambda = 0,14 W/mK"},null,140,0.14,{"v":1,"d":"1.0000"},"Bron: Porotherm",null,null,"Cellenbeton lambda = 0,14 W/mK",{"$nulls":3},"Béton cellulaire lambda = 0,14 W/mK"]
[5,{"$f":"IF(Ber!A$78=1,Geg!J57,Geg!N57)","v":"Cellenbeton lambda = 0,17 W/mK"},null,140,0.17,{"v":0.823529411764706,"d":"0.8235"},"Bron: Porotherm",null,null,"Cellenbeton lambda = 0,17 W/mK",{"$nulls":3},"Béton cellulaire lambda = 0,17 W/mK"]
[6,{"$f":"IF(Ber!A$78=1,Geg!J58,Geg!N58)","v":"Kalkzandsteen lambda = 0,50 W/mK"},null,140,0.5,{"v":0.28,"d":"0.2800"},"Bron: Porotherm",null,null,"Kalkzandsteen lambda = 0,50 W/mK",{"$nulls":3},"Blocs silico calcaire lambda = 0,50 W/mK"]
[7,{"$f":"IF(Ber!A$78=1,Geg!J59,Geg!N59)","v":"Kalkzandsteen lambda = 0,70 W/mK"},null,140,0.7,{"v":0.20000000000000004,"d":"0.2000"},"Bron: Porotherm",null,null,"Kalkzandsteen lambda = 0,70 W/mK",{"$nulls":3},"Blocs silico calcaire lambda = 0,70 W/mK"]
[8,{"$f":"IF(Ber!A$78=1,Geg!J60,Geg!N60)","v":"Kalkzandsteen lambda = 0,93 W/mK"},null,140,0.93,{"$f":"(D60/1000)/E60","v":{"v":0.15053763440860216,"d":"0.1505"}},"Bron: Porotherm",null,null,"Kalkzandsteen lambda = 0,93 W/mK",{"$nulls":3},"Blocs silico calcaire lambda = 0,93 W/mK"]
[9,{"$f":"IF(Ber!A$78=1,Geg!J61,Geg!N61)","v":"Porotherm PLS 90"},null,90,0.29,{"v":0.3103448275862069,"d":"0.3103"},"Bron: Porotherm",null,null,"Porotherm PLS 90",{"$nulls":3},"Porotherm PLS 90"]
[10,{"$f":"IF(Ber!A$78=1,Geg!J62,Geg!N62)","v":"Porotherm PLS 140"},null,140,0.26,{"v":0.5384615384615385,"d":"0.5385"},"Bron: Porotherm",null,null,"Porotherm PLS 140",{"$nulls":3},"Porotherm PLS 140"]
[11,{"$f":"IF(Ber!A$78=1,Geg!J63,Geg!N63)","v":"Porotherm Hogedruk 90"},null,90,0.32,{"v":0.28125,"d":"0.2813"},"Bron: Porotherm",null,null,"Porotherm Hogedruk 90",{"$nulls":3},"Porotherm Hogedruk 90"]
[12,{"$f":"IF(Ber!A$78=1,Geg!J64,Geg!N64)","v":"Porotherm Hogedruk 140"},null,140,0.35,{"v":0.4000000000000001,"d":"0.4000"},"Bron: Porotherm",null,null,"Porotherm Hogedruk 140",{"$nulls":3},"Porotherm Hogedruk 140"]
[13,{"$f":"IF(Ber!A$78=1,Geg!J65,Geg!N65)","v":"Porotherm silent brick"},null,90,0.39,{"v":0.23076923076923075,"d":"0.2308"},"Bron: Porotherm",null,null,"Porotherm silent brick",{"$nulls":3},"Porotherm Silentbrick"]
[14,{"$f":"IF(Ber!A$78=1,Geg!J66,Geg!N66)","v":"Snelbouwsteen"},null,140,0.41,{"v":0.34146341463414637,"d":"0.3415"},"Bron: Butgb",null,null,"Snelbouwsteen",{"$nulls":3},"Bloc treilli"]
[15,{"$f":"IF(Ber!A$78=1,Geg!J67,Geg!N67)","v":"Beton lambda = 1,00 W/mK"},null,80,1,{"v":0.08,"d":"0.0800"},{"$nulls":3},"Beton lambda = 1,00 W/mK",{"$nulls":3},"Béton lambda = 1,00 W/mK"]
[]
["Bepleistering",null,null,"d",null,"l","Rm"]
[{"$nulls":3},"mm",null,"W/mK","m²K/W",null,null,"Ned",{"$nulls":3},"Frans"]
[1,{"$f":"IF(Ber!A$78=1,Geg!J71,Geg!N71)","v":"Gipspleister"},null,0,"0 mm",0.52,{"$f":"(D71/1000)/F71","v":{"v":0,"d":"0.0000"}},"Bron: Butgb",null,"Gipspleister",{"$nulls":3},"Plâtre"]
[2,{"$f":"IF(Ber!A$78=1,Geg!J72,Geg!N72)","v":"Gipspleister"},null,10,"10 mm",0.52,{"$f":"(D72/1000)/F72","v":{"v":0.019230769230769232,"d":"0.0192"}},"Bron: Butgb",null,"Gipspleister",{"$nulls":3},"Plâtre"]
[3,{"$f":"IF(Ber!A$78=1,Geg!J73,Geg!N73)","v":"Gipspleister"},null,15,"15 mm",0.52,{"$f":"(D73/1000)/F73","v":{"v":0.028846153846153844,"d":"0.0288"}},"Bron: Butgb",null,"Gipspleister",{"$nulls":3},"Plâtre"]
[]
["Isolatie"]
[]
[1,"PolyFort+"]
[2,"W-PF"]
[]
["Lambda declared isolatie",null,null,"d","l","RD"]
[null,{"$f":"IF(Ber!D57=1,\"PolyFort+\",\"W-PF\")","v":"PolyFort+"},null,"mm","W/mK","m²K/W"]
[null,null,{"$f":"IF(Ber!D$57=1,\"40 mm\",\"60 mm\")","v":"40 mm"},{"$f":"IF(Ber!D57=1,40,60)","v":40},{"$f":"IF(Ber!D$57=1,0.031,0.035)","v":0.031},{"$f":"FLOOR((D82/1000)/E82,0.05)","v":1.25}]
[null,null,{"$f":"IF(Ber!D$57=1,\"50 mm\",\"80 mm\")","v":"50 mm"},{"$f":"IF(Ber!D57=1,50,80)","v":50},{"$f":"IF(Ber!D$57=1,0.031,0.035)","v":0.031},{"v":1.6,"d":"1.60"}]
[null,null,{"$f":"IF(Ber!D$57=1,\"60 mm\",\"100 mm\")","v":"60 mm"},{"$f":"IF(Ber!D57=1,60,100)","v":60},{"$f":"IF(Ber!D$57=1,0.031,0.035)","v":0.031},{"v":1.9000000000000001,"d":"1.90"}]
[null,null,"79 mm",79,{"$f":"IF(Ber!D$57=1,0.031,0.035)","v":0.031},{"v":2.5,"d":"2.50"}]
[1,null,"110 mm",110,{"$f":"IF(Ber!D$57=1,0.031,0.035)","v":0.031},{"$f":"FLOOR((D86/1000)/E86,0.05)","v":{"v":3.5,"d":"3.50"}}]
[2,null,"124 mm",124,0.031,{"$f":"FLOOR((D87/1000)/E87,0.05)","v":{"v":4,"d":"4.00"}}]
[3,null,"134 mm",134,0.031,{"$f":"FLOOR((D88/1000)/E88,0.05)","v":{"v":4.3,"d":"4.30"}}]
[4,null,"165 mm",165,0.031,{"$f":"FLOOR((D89/1000)/E89,0.05)","v":{"v":5.300000000000001,"d":"5.30"}}]
[5,null,"196 mm",196,0.031,{"v":6.9,"d":"6.90"}]
[6,null,"2 x 110 mm",220,0.031,{"$f":"FLOOR((D91/1000)/E91,0.05)","v":{"v":7.050000000000001,"d":"7.05"}}]
[7,null,"110+124mm",234,0.031,{"$f":"FLOOR((D92/1000)/E92,0.05)","v":{"v":7.5,"d":"7.50"}}]
[8,null,"110+134 mm",244,0.031,{"$f":"FLOOR((D93/1000)/E93,0.05)","v":{"v":7.8500000000000005,"d":"7.85"}}]
[9,null,"110+165mm",275,0.031,{"$f":"FLOOR((D94/1000)/E94,0.05)","v":8.85}]
[10]
[]
[]
[]
[]
[]
["Dikten (vrije materialen)"]
[]
[1,30,30]
[2,40,40]
[3,45,45]
[4,50,50]
[5,55,55]
[6,60,60]
[7,65,65]
[8,70,70]
[9,79,79]
[10,80,80]
[11,90,90]
[12,93,93]
[13,100,100]
[14,109,109]
[]
[]
["Bevestigers",{"$nulls":3},"l","A"]
[{"$nulls":4},"W/mK","m²",null,null,"Ned",null,null,"Frans"]
[1,{"$f":"IF(Ber!A78=1,Geg!I121,Geg!L121)","v":"RVS Ø 4,2 mm"},null,null,15,{"$f":"(1/4)*(22/7)*((4.2*4.2)/(1000*1000))","v":{"v":1.386e-05,"d":"0.0000139"}},null,null,"RVS Ø 4,2 mm",null,null,"Acier inoxydable Ø 4,2 mm"]
[2,{"$f":"IF(Ber!A78=1,Geg!I122,Geg!L122)","v":"RVS Ø 4,8 mm"},null,null,15,{"$f":"(1/4)*(22/7)*((4.8*4.8)/(1000*1000))","v":{"v":1.8102857142857143E-5,"d":"1.81E-05"}},null,null,"RVS Ø 4,8 mm",null,null,"Acier inoxydable Ø 4,8 mm"]
[3,{"$f":"IF(Ber!A78=1,Geg!I123,Geg!L123)","v":"Gegalv. staal  Ø 4,0 mm"},null,null,50,{"$f":"1.3/100000","v":1.3000000000000001E-5},"Bron: Butgb *)",null,"Gegalv. staal  Ø 4,0 mm",null,null,"Acier galvanisé  Ø 4,0 mm"]
[4,{"$f":"IF(Ber!A78=1,Geg!I124,Geg!L124)","v":"Gegalv. staal  Ø 4,2 mm"},null,null,50,{"$f":"(1/4)*(22/7)*((4.2*4.2)/(1000*1000))","v":1.386e-05},null,null,"Gegalv. staal  Ø 4,2 mm",null,null,"Acier galvanisé  Ø 4,2 mm"]
[5,{"$f":"IF(Ber!A78=1,Geg!I125,Geg!L125)","v":"Gegalv. staal  Ø 4,8 mm"},null,null,50,{"$f":"(1/4)*(22/7)*((4.8*4.8)/(1000*1000))","v":1.8102857142857143E-5},null,null,"Gegalv. staal  Ø 4,8 mm",null,null,"Acier galvanisé  Ø 4,8 mm"]
[]
["Aantal bevestigers",{"$nulls":4},"*) eig: ",{"$f":"(1/4)*(22/7)*((4*4)/(1000*1000))","v":1.257142857142857E-5}]
[1,1]
[2,2]
[3,3]
[4,4]
[5,5]
[6,6]
[7,7]
[]
[]
["Concurrentie isolatie"]
[]
[1,"MMMF 33",0.033,"W/mK"]
[2,"MMMF 34",0.034,"W/mK"]
[3,"MMMF 35",0.035,"W/mK"]
[4,"XPS 34",0.034,"W/mK"]
[5,"XPS 36",0.036,"W/mK"]
[6,"PU 23",0.023,"W/mK"]
[7,"PU 24",0.024,"W/mK"]
[8,"PU 25",0.025,"W/mK"]
[9,"PU 26",0.026,"W/mK"]
[10,"PU 27",0.027,"W/mK"]
[11,"PU 28",0.028,"W/mK"]
[12,"PU 29",0.029,"W/mK"]
[13,"EPS 60",0.038,"W/mK"]
[14,"EPS 100",0.036,"W/mK"]
[15,"EPS 60 HR 30",{"v":0.03,"d":"0.030"},"W/mK"]
[16,"EPS 60 HR 31",0.031,"W/mK"]
[]
["Alufolie"]
[]
[1,"ja",0.39,"m²K/W"]
[2,"nee",0,"m²K/W"]
[]
[]
[null,"Taal"]
[1,"Nederlands"]
[2,"Français"]
[]
[null,"Berekening R en U waarden spouwmuurconstructies ",{"$nulls":6},"Chiffrage des valeurs R et U des constructions de murs creux conformément "]
[null,"conform STS 08.82 en Butgb-informatieblad ",{"$nulls":6},"au STS 08.82 et le Feuillet d'information de l'UBAtc \"Mur creux isolés "]
[null,"\"Geïsoleerde spouwmuren met gevelmetselwerk\" ",{"$nulls":6},"de façades et maçonnerie\" "]
[]
[null,"PROJECT:  ",{"$nulls":6},"PROJECT:  "]
[null,"Aanvrager:  ",{"$nulls":6},"Demandeur:"]
[null,"Onderdeel:  ",{"$nulls":6},"Section:"]
[]
[]
[null,"Uitgangspunten:",{"$nulls":6},"Points de départ:"]
[null,"Buitenspouwblad",{"$nulls":3},"Baksteen",null,null,"Paroi extérieur",{"$nulls":3},"Brique"]
[null,"Luchtspouw",{"$nulls":6},"Vide d'air"]
[null,"Isolatie",{"$nulls":6},"Isolation"]
[null,"Soort en aantal bevestigers",{"$nulls":6},"Sorte et nombre d'attaches"]
[null,"Binnenspouwblad",{"$nulls":6},"Paroi intérieur"]
[null,"Pleisterlaag",{"$nulls":3},"Gipspleister",null,null,"Plâtrage",{"$nulls":3},"Plâtre"]
[]
[]
[null,"Aan de uitkomsten van dit programma kunnen geen rechten bij IsoBouw Systems bv worden ontleend. Een ",{"$nulls":8},"IsoBouw Systems bv ne peut en aucun cas être tenu pour responsable quant aux résultats de ce"]
[null,"herberekening conform dit programma is door IsoBouw Systems bv mogelijk. Dit programma is intellectueel ",{"$nulls":8},"programme. Conformément à ce programme, IsoBouw Systems bv est en mesure de procéder à un"]
[null,"eigendom van IsoBouw Systems bv en mag als zodanig niet worden aangepast op welke wijze dan ook. ©",{"$nulls":8},"recalcul. Ce programme est la propriété intellectuelle d'IsoBouw Systems bv et ne doit, en tant que"]
[{"$nulls":10},"tel, pas être modifié, de quelque manière que ce soit. ©"]

{"sheet":"Contr conc","index":2,"n_rows":64,"n_cols":16,"rows_kept":64,"hidden":true}
["Kemisol",{"$nulls":4},"Isomo"]
["EPS 100",{"$nulls":4},"EPS 60 (grijs?)"]
[{"$nulls":5},"met 2 zijdig alufolie"]
[]
[null,"d","l","RD",null,"d","l","RD"]
[]
[null,40,0.036,{"$f":"FLOOR((B7/1000)/C7,0.05)","v":{"v":1.1,"d":"1.10"}},null,30,null,{"v":2.1,"d":"2.10"}]
[null,50,{"$f":"C7","v":0.036},{"$f":"FLOOR((B8/1000)/C8,0.05)","v":1.35},null,40,{"$f":"G7","v":0},{"v":2.4,"d":"2.40"}]
[null,60,{"$f":"C7","v":0.036},{"v":1.6500000000000001,"d":"1.65"},null,45,{"$f":"G7","v":0},{"v":2.6,"d":"2.60"}]
[null,70,{"$f":"C7","v":0.036},{"v":1.9000000000000001,"d":"1.90"},null,50,{"$f":"G7","v":0},{"v":2.7,"d":"2.70"}]
[null,80,{"$f":"C7","v":0.036},{"v":2.2,"d":"2.20"},null,55,{"$f":"G7","v":0},{"v":2.9,"d":"2.90"}]
[null,90,{"$f":"C7","v":0.036},{"v":2.5,"d":"2.50"},null,60,{"$f":"G7","v":0},{"v":3,"d":"3.00"}]
[null,100,{"$f":"C7","v":0.036},2.75,null,80,{"$f":"G7","v":0},{"v":3.6,"d":"3.60"}]
[null,110,{"$f":"C7","v":0.036},{"v":3.0500000000000003,"d":"3.05"}]
[null,120,{"$f":"C7","v":0.036},{"v":3.3000000000000003,"d":"3.30"}]
[]
["Isover","d","l",{"$nulls":6},"RD"]
[null,null,"mupan plus","mupan facade","easypan","facade 100","PAM E428","Mupan","Facade 40","mupan plus","mupan facade","easypan","facade 100","PAM E428","Mupan","Facade 40"]
[null,70,0.033,0.033,0.034,0.034,0.034,0.035,0.035,{"$f":"FLOOR(($B19/1000)/C19,0.05)","v":{"v":2.1,"d":"2.10"}},{"$f":"FLOOR(($B19/1000)/D19,0.05)","v":{"v":2.1,"d":"2.10"}},{"v":2.0500000000000003,"d":"2.05"},{"v":2.0500000000000003,"d":"2.05"},{"v":2.0500000000000003,"d":"2.05"},{"v":2,"d":"2.00"},{"v":2,"d":"2.00"}]
[null,80,0.033,0.033,0.034,0.034,0.034,0.035,0.035,{"$f":"FLOOR(($B20/1000)/C20,0.05)","v":{"v":2.4000000000000004,"d":"2.40"}},{"$f":"FLOOR(($B20/1000)/D20,0.05)","v":{"v":2.4000000000000004,"d":"2.40"}},2.35,2.35,2.35,2.25,2.25]
[null,90,0.033,0.033,0.034,0.034,0.034,0.035,0.035,{"$f":"FLOOR(($B21/1000)/C21,0.05)","v":{"v":2.7,"d":"2.70"}},{"v":2.7,"d":"2.70"},{"v":2.6,"d":"2.60"},{"v":2.6,"d":"2.60"},{"v":2.6,"d":"2.60"},{"v":2.5500000000000003,"d":"2.55"},{"v":2.5500000000000003,"d":"2.55"}]
[null,100,0.033,0.033,0.034,0.034,0.034,0.035,0.035,{"$f":"FLOOR(($B22/1000)/C22,0.05)","v":{"v":3,"d":"3.00"}},{"v":3,"d":"3.00"},{"v":2.9000000000000004,"d":"2.90"},{"v":2.9000000000000004,"d":"2.90"},{"v":2.9000000000000004,"d":"2.90"},2.85,2.85]
[]
[{"$nulls":6},{"$f":"FLOOR((0.04/0.034),0.05)","v":{"v":1.1500000000000001,"d":"1.15"}},null,{"$f":"FLOOR((0.05/0.035),0.05)","v":{"v":1.4000000000000001,"d":"1.40"}}]
[]
[]
["Uitgangspunten:"]
["Buitenspouwblad",{"$nulls":6},"90 mm ",90]
["Luchtspouw"]
["Alu folie"]
["Isolatie"]
["Soort en aantal bevestigers"]
["Binnenspouwblad",{"$nulls":6},{"$f":"IF(D50=9,\"90 mm\",IF(D50=11,\"90 mm\",IF(D50=13,\"90 mm\",\"140 mm\")))","v":"140 mm"},{"$f":"IF(D50=9,90,IF(D50=11,90,IF(D50=13,90,140)))","v":140}]
["Pleisterlaag",{"$nulls":3},"Gipspleister"]
[]
[]
[]
[]
["UC =",null,{"$f":"L63","v":{"v":0.38732163696199096,"d":"0.39"}},"W/m²K"]
["RD = ",null,{"$f":"FLOOR(K49,0.05)","v":{"v":2.1,"d":"2.10"}},"m²K/W"]
["RC =",null,{"$f":"K64","v":{"v":2.4118335578761716,"d":"2.41"}},"m²K/W"]
[]
[{"$nulls":3},"nr",null,"d","l","aant","A",null,"R","U"]
[{"$nulls":5},"m","W/mK",null,"m²",null,"m²K/W","W/m²K"]
["Rse =",{"$nulls":9},{"$f":"Geg!F36","v":0.04}]
["Buitenspouwblad =",null,null,1,1,{"$f":"(VLOOKUP(E46,Geg!A43:D43,4)/1000)","v":0.09},{"$f":"VLOOKUP(E46,Geg!A43:F43,6)","v":1.31},{"$nulls":3},{"$f":"F46/G46","v":{"v":0.06870229007633587,"d":"0.0687"}}]
["Luchtspouw =",null,null,3,{"$nulls":6},{"$f":"VLOOKUP(D47,Geg!A47:F49,6)","v":0.09}]
["Alufolie =",null,null,2,{"$nulls":6},{"$f":"VLOOKUP(D48,Geg!A158:C159,3)","v":0}]
["Isolatie =",null,null,11,6,{"$f":"VLOOKUP(E49,Geg!A103:C115,3)/1000","v":0.06},{"$f":"VLOOKUP(D49,Geg!A139:C154,3)","v":0.028},{"$nulls":3},{"$f":"F49/G49","v":{"v":2.142857142857143,"d":"2.1429"}}]
["Binnenspouwblad =",null,null,14,null,{"$f":"VLOOKUP(D50,Geg!A53:D55,4)/1000","v":0.14},{"$f":"VLOOKUP(D50,Geg!A53:E66,5)","v":0.41},{"$nulls":3},{"$f":"F50/G50","v":{"v":0.34146341463414637,"d":"0.3415"}}]
["Pleisterwerk =",{"$nulls":3},2,{"$f":"VLOOKUP(E51,Geg!A71:D73,4)/1000","v":0.01},{"$f":"VLOOKUP(E51,Geg!A71:F73,6)","v":0.52},{"$nulls":3},{"$f":"F51/G51","v":{"v":0.019230769230769232,"d":"0.0192"}}]
["Rsi =",{"$nulls":9},{"$f":"Geg!F37","v":0.13}]
["Rcorr =  ",{"$nulls":9},{"$f":"Geg!E26","v":{"v":-0.1,"d":"-0.100"}}]
["Rtot = ",{"$nulls":9},{"$f":"SUM(K45:K53)","v":{"v":2.7322536167983937,"d":"2.732"}}]
["U =",{"$nulls":10},{"$f":"1/K54","v":{"v":0.36599823451667063,"d":"0.37"}}]
["a =",{"$nulls":8},{"$f":"Geg!E38","v":0.8}]
["lf =",null,null,3,null,null,{"$f":"VLOOKUP(D57,Geg!A121:E125,5)","v":50}]
["Af =",{"$nulls":5}," ",null,{"$f":"VLOOKUP(D57,Geg!A121:F125,6)","v":1.3000000000000001E-5}]
["nf =",null,null,4,{"$nulls":3},{"$f":"VLOOKUP(D59,Geg!A128:B134,2)","v":4}]
["di =",{"$nulls":4},{"$f":"F49","v":0.06}]
["DUg =",{"$nulls":10},{"$f":"Geg!E39","v":0}]
["DUf =","a*((lf*Af*nf)/di)*(Risol/Rtot)²",{"$nulls":9},{"$f":"(J56*(G57*I58*H59)/F60)*(K49/K54)*(K49/K54)","v":{"v":0.0213234024453203,"d":"0.02132"}},null,{"$f":"0.06*50*5*0.000013","v":1.95E-4}]
["Uc = ",{"$nulls":10},{"$f":"L55+L61+L62","v":{"v":0.38732163696199096,"d":"0.39"}}]
["RC =",{"$nulls":9},{"$f":"1/L63-(K45+K52)","v":{"v":2.4118335578761716,"d":"2.41"}}]

{"sheet":"Standaardconstr","index":3,"n_rows":15,"n_cols":7,"rows_kept":15,"hidden":true}
[]
[]
[{"$nulls":4},"l","d","R"]
[null,"Rse",{"$nulls":4},0.13]
[null,"Rse",{"$nulls":4},0.04]
[null,"Buitenspouwblad",null,null,1.31,0.09,{"$f":"F6/E6","v":{"v":0.06870229007633587,"d":"0.0687"}}]
[null,"Luchtspouw (30 mm zwak geventileerd)",{"$nulls":4},0.09]
[null,"Isolatie"]
[null,"Binnenspouwblad",null,null,0.41,0.14,{"$f":"F9/E9","v":{"v":0.34146341463414637,"d":"0.3415"}}]
[null,"Gipspleister",null,null,0.52,0.01,{"$f":"F10/E10","v":{"v":0.019230769230769232,"d":"0.0192"}}]
[]
[]
[]
[null,"Ankers : 4 stuks /m² ",null,"Ø4 l = 0,50"]
[null,"gegalvaniseerd staal Ø 4"]

{"sheet":"Vergelijk tbv brochure","index":4,"n_rows":28,"n_cols":5,"rows_kept":28,"hidden":true}
["Waarden PolyFort+"]
[]
[]
["RD","(m²K/W)"]
[]
["dikte","(mm)","PolyFort+","XPS **","MW **"]
[]
[40,null,{"$f":"FLOOR((A8/1000)/0.031,0.05)","v":1.25},{"$f":"FLOOR((A8/1000)/0.034,0.05)","v":{"v":1.1500000000000001,"d":"1.15"}},{"$f":"FLOOR((A8/1000)/0.035,0.05)","v":{"v":1.1,"d":"1.10"}}]
[50,null,{"v":1.6,"d":"1.60"},{"$f":"FLOOR((A9/1000)/0.034,0.05)","v":{"v":1.4500000000000002,"d":"1.45"}},{"v":1.4000000000000001,"d":"1.40"}]
[60,null,{"v":1.9000000000000001,"d":"1.90"},{"$f":"FLOOR((A10/1000)/0.036,0.05)","v":{"v":1.6500000000000001,"d":"1.65"}},{"v":1.7000000000000002,"d":"1.70"}]
[79,null,{"v":2.5,"d":"2.50"},{"$f":"FLOOR((A11/1000)/0.036,0.05)","v":2.15},2.25]
[93,null,{"v":3,"d":"3.00"},{"$f":"FLOOR((A12/1000)/0.036,0.05)","v":{"v":2.5500000000000003,"d":"2.55"}},{"v":2.6500000000000004,"d":"2.65"}]
[109,null,{"v":3.5,"d":"3.50"},{"$f":"FLOOR((A13/1000)/0.036,0.05)","v":{"v":3,"d":"3.00"}},{"v":3.1,"d":"3.10"}]
[]
["**: Lambda declared XPS = 0,034 tot 60 mm, daarboven 0,036 en MW = 0,035 W/mK"]
[]
["UC *","(W/m²K)"]
[]
["dikte","(mm)","PolyFort+","XPS **","MW **"]
[]
[40,null,0.56,0.59,{"v":0.6,"d":"0.60"}]
[50,null,0.48,0.51,0.52]
[60,null,0.42,0.45,0.45]
[79,null,0.34,0.37,0.37]
[93,null,0.29,0.32,0.32]
[109,null,0.26,{"v":0.3,"d":"0.30"},{"v":0.3,"d":"0.30"}]
[]
["* Bij gelijke gevelopbouw"]

{"sheet":"Decker","index":5,"n_rows":129,"n_cols":79,"rows_kept":129,"hidden":true}
[]
["basis"]
[null,"d","l","R"]
[null,"mm","W/mK","m²K/W"]
["binnen",null,null,0.13]
["hout",null,0.13,{"$f":"(B6/1000)/C6","v":0}]
["EPS HR (PolyFort)",null,0.031,{"$f":"(B7/1000)/C7","v":0}]
["folie",null,null,0]
["spouw, 30 mm licht geventileerd",null,null,0.09]
["steen",90,1.31,{"$f":"(B10/1000)/C10","v":0.06870229007633587}]
["buiten",null,null,0.04]
[]
["correctie",null,null,-0.1]
[]
["Rtot",null,null,{"$f":"FLOOR(SUM(D5:D13),0.05)","v":{"v":0.2,"d":"0.20"}}]
[]
["ED-PSP (5 plis)",{"$nulls":19},"ED-PSP (3 plis)",{"$nulls":19},"ED-BSP (7 plis)",{"$nulls":19},"MHM"]
[]
[null,"d","l","R",null,null,"d","l","R",null,null,"d","l","R",null,null,"d","l","R",null,null,"d","l","R",null,null,"d","l","R",null,null,"d","l","R",null,null,"d","l","R",null,null,"d","l","R",null,null,"d","l","R",null,null,"d","l","R",null,null,"d","l","R",null,null,"d","l","R",null,null,"d","l","R",null,null,"d","l","R",null,null,"d","l","R"]
[null,"mm","W/mK","m²K/W",null,null,"mm","W/mK","m²K/W",null,null,"mm","W/mK","m²K/W",null,null,"mm","W/mK","m²K/W",null,null,"mm","W/mK","m²K/W",null,null,"mm","W/mK","m²K/W",null,null,"mm","W/mK","m²K/W",null,null,"mm","W/mK","m²K/W",null,null,"mm","W/mK","m²K/W",null,null,"mm","W/mK","m²K/W",null,null,"mm","W/mK","m²K/W",null,null,"mm","W/mK","m²K/W",null,null,"mm","W/mK","m²K/W",null,null,"mm","W/mK","m²K/W",null,null,"mm","W/mK","m²K/W",null,null,"mm","W/mK","m²K/W"]
["binnen",null,null,0.13,null,"binnen",null,null,0.13,null,"binnen",null,null,0.13,null,"binnen",null,null,0.13,null,"binnen",null,null,0.13,null,"binnen",null,null,0.13,null,"binnen",null,null,0.13,null,"binnen",null,null,0.13,null,"binnen",null,null,0.13,null,"binnen",null,null,0.13,null,"binnen",null,null,0.13,null,"binnen",null,null,0.13,null,"binnen",null,null,0.13,null,"binnen",null,null,0.13,null,"binnen",null,null,0.13,null,"binnen",null,null,0.13]
["hout",109,0.13,{"$f":"(B22/1000)/C22","v":0.8384615384615385},null,"hout",109,0.13,{"$f":"(G22/1000)/H22","v":0.8384615384615385},null,"hout",109,0.13,{"$f":"(L22/1000)/M22","v":0.8384615384615385},null,"hout",109,0.13,{"$f":"(Q22/1000)/R22","v":0.8384615384615385},null,"hout",109,0.13,{"$f":"(V22/1000)/W22","v":0.8384615384615385},null,"hout",109,0.13,{"$f":"(AA22/1000)/AB22","v":0.8384615384615385},null,"hout",109,0.13,{"$f":"(AF22/1000)/AG22","v":0.8384615384615385},null,"hout",109,0.13,{"$f":"(AK22/1000)/AL22","v":0.8384615384615385},null,"hout",130,0.13,{"$f":"(AP22/1000)/AQ22","v":1},null,"hout",130,0.13,{"$f":"(AU22/1000)/AV22","v":1},null,"hout",130,0.13,{"$f":"(AZ22/1000)/BA22","v":1},null,"hout",130,0.13,{"$f":"(BE22/1000)/BF22","v":1},null,"hout",115,0.13,{"$f":"(BJ22/1000)/BK22","v":0.8846153846153846},null,"hout",115,0.13,{"$f":"(BO22/1000)/BP22","v":0.8846153846153846},null,"hout",115,0.13,{"$f":"(BT22/1000)/BU22","v":0.8846153846153846},null,"hout",115,0.13,{"$f":"(BY22/1000)/BZ22","v":0.8846153846153846}]
["EPS HR (PolyFort)",60,0.031,{"$f":"(B23/1000)/C23","v":1.9354838709677418},null,"EPS HR (PolyFort)",79,0.031,{"$f":"(G23/1000)/H23","v":2.5483870967741935},null,"EPS HR (PolyFort)",93,0.031,{"$f":"(L23/1000)/M23","v":3},null,"EPS HR (PolyFort)",109,0.031,{"$f":"(Q23/1000)/R23","v":3.5161290322580645},null,"EPS HR (PolyFort)",60,0.031,{"$f":"(V23/1000)/W23","v":1.9354838709677418},null,"EPS HR (PolyFort)",79,0.031,{"$f":"(AA23/1000)/AB23","v":2.5483870967741935},null,"EPS HR (PolyFort)",93,0.031,{"$f":"(AF23/1000)/AG23","v":3},null,"EPS HR (PolyFort)",109,0.031,{"$f":"(AK23/1000)/AL23","v":3.5161290322580645},null,"EPS HR (PolyFort)",60,0.031,{"$f":"(AP23/1000)/AQ23","v":1.9354838709677418},null,"EPS HR (PolyFort)",79,0.031,{"$f":"(AU23/1000)/AV23","v":2.5483870967741935},null,"EPS HR (PolyFort)",93,0.031,{"$f":"(AZ23/1000)/BA23","v":3},null,"EPS HR (PolyFort)",109,0.031,{"$f":"(BE23/1000)/BF23","v":3.5161290322580645},null,"EPS HR (PolyFort)",60,0.031,{"$f":"(BJ23/1000)/BK23","v":1.9354838709677418},null,"EPS HR (PolyFort)",79,0.031,{"$f":"(BO23/1000)/BP23","v":2.5483870967741935},null,"EPS HR (PolyFort)",93,0.031,{"$f":"(BT23/1000)/BU23","v":3},null,"EPS HR (PolyFort)",109,0.031,{"$f":"(BY23/1000)/BZ23","v":3.5161290322580645}]
["folie",null,null,0,null,"folie",null,null,0,null,"folie",null,null,0,null,"folie",null,null,0,null,"folie",null,null,0,null,"folie",null,null,0,null,"folie",null,null,0,null,"folie",null,null,0,null,"folie",null,null,0,null,"folie",null,null,0,null,"folie",null,null,0,null,"folie",null,null,0,null,"folie",null,null,0,null,"folie",null,null,0,null,"folie",null,null,0,null,"folie",null,null,0]
["spouw, 30 mm licht geventileerd",null,null,0.09,null,"spouw, 30 mm licht geventileerd",null,null,0.09,null,"spouw, 30 mm licht geventileerd",null,null,0.09,null,"spouw, 30 mm licht geventileerd",null,null,0.09,null,"spouw, 30 mm licht geventileerd",null,null,0.09,null,"spouw, 30 mm licht geventileerd",null,null,0.09,null,"spouw, 30 mm licht geventileerd",null,null,0.09,null,"spouw, 30 mm licht geventileerd",null,null,0.09,null,"spouw, 30 mm licht geventileerd",null,null,0.09,null,"spouw, 30 mm licht geventileerd",null,null,0.09,null,"spouw, 30 mm licht geventileerd",null,null,0.09,null,"spouw, 30 mm licht geventileerd",null,null,0.09,null,"spouw, 30 mm licht geventileerd",null,null,0.09,null,"spouw, 30 mm licht geventileerd",null,null,0.09,null,"spouw, 30 mm licht geventileerd",null,null,0.09,null,"spouw, 30 mm licht geventileerd",null,null,0.09]
["steen",90,1.31,{"$f":"(B26/1000)/C26","v":0.06870229007633587},null,"steen",90,1.31,{"$f":"(G26/1000)/H26","v":0.06870229007633587},null,"steen",90,1.31,{"$f":"(L26/1000)/M26","v":0.06870229007633587},null,"steen",90,1.31,{"$f":"(Q26/1000)/R26","v":0.06870229007633587},null,"steen",90,1.31,{"$f":"(V26/1000)/W26","v":0.06870229007633587},null,"steen",90,1.31,{"$f":"(AA26/1000)/AB26","v":0.06870229007633587},null,"steen",90,1.31,{"$f":"(AF26/1000)/AG26","v":0.06870229007633587},null,"steen",90,1.31,{"$f":"(AK26/1000)/AL26","v":0.06870229007633587},null,"steen",90,1.31,{"$f":"(AP26/1000)/AQ26","v":0.06870229007633587},null,"steen",90,1.31,{"$f":"(AU26/1000)/AV26","v":0.06870229007633587},null,"steen",90,1.31,{"$f":"(AZ26/1000)/BA26","v":0.06870229007633587},null,"steen",90,1.31,{"$f":"(BE26/1000)/BF26","v":0.06870229007633587},null,"steen",90,1.31,{"$f":"(BJ26/1000)/BK26","v":0.06870229007633587},null,"steen",90,1.31,{"$f":"(BO26/1000)/BP26","v":0.06870229007633587},null,"steen",90,1.31,{"$f":"(BT26/1000)/BU26","v":0.06870229007633587},null,"steen",90,1.31,{"$f":"(BY26/1000)/BZ26","v":0.06870229007633587}]
["buiten",null,null,0.04,null,"buiten",null,null,0.04,null,"buiten",null,null,0.04,null,"buiten",null,null,0.04,null,"buiten",null,null,0.04,null,"buiten",null,null,0.04,null,"buiten",null,null,0.04,null,"buiten",null,null,0.04,null,"buiten",null,null,0.04,null,"buiten",null,null,0.04,null,"buiten",null,null,0.04,null,"buiten",null,null,0.04,null,"buiten",null,null,0.04,null,"buiten",null,null,0.04,null,"buiten",null,null,0.04,null,"buiten",null,null,0.04]
[]
["correctie",null,null,-0.1,null,"correctie",null,null,-0.1,null,"correctie",null,null,-0.1,null,"correctie",null,null,-0.1,null,"correctie",null,null,-0.1,null,"correctie",null,null,-0.1,null,"correctie",null,null,-0.1,null,"correctie",null,null,-0.1,null,"correctie",null,null,-0.1,null,"correctie",null,null,-0.1,null,"correctie",null,null,-0.1,null,"correctie",null,null,-0.1,null,"correctie",null,null,-0.1,null,"correctie",null,null,-0.1,null,"correctie",null,null,-0.1,null,"correctie",null,null,-0.1]
[]
["Rtot",null,null,{"$f":"FLOOR(SUM(D21:D29),0.05)","v":{"v":3,"d":"3.00"}},null,"Rtot",null,null,{"$f":"FLOOR(SUM(I21:I29),0.05)","v":{"v":3.6,"d":"3.60"}},null,"Rtot",null,null,{"$f":"FLOOR(SUM(N21:N29),0.05)","v":4.05},null,"Rtot",null,null,{"$f":"FLOOR(SUM(S21:S29),0.05)","v":4.55},null,"Rtot",null,null,{"$f":"FLOOR(SUM(X21:X29),0.05)","v":{"v":3,"d":"3.00"}},null,"Rtot",null,null,{"$f":"FLOOR(SUM(AC21:AC29),0.05)","v":{"v":3.6,"d":"3.60"}},null,"Rtot",null,null,{"$f":"FLOOR(SUM(AH21:AH29),0.05)","v":4.05},null,"Rtot",null,null,{"$f":"FLOOR(SUM(AM21:AM29),0.05)","v":4.55},null,"Rtot",null,null,{"$f":"FLOOR(SUM(AR21:AR29),0.05)","v":{"v":3.1500000000000004,"d":"3.15"}},null,"Rtot",null,null,{"$f":"FLOOR(SUM(AW21:AW29),0.05)","v":3.75},null,"Rtot",null,null,{"$f":"FLOOR(SUM(BB21:BB29),0.05)","v":{"v":4.2,"d":"4.20"}},null,"Rtot",null,null,{"$f":"FLOOR(SUM(BG21:BG29),0.05)","v":{"v":4.7,"d":"4.70"}},null,"Rtot",null,null,{"$f":"FLOOR(SUM(BL21:BL29),0.05)","v":{"v":3,"d":"3.00"}},null,"Rtot",null,null,{"$f":"FLOOR(SUM(BQ21:BQ29),0.05)","v":{"v":3.6500000000000004,"d":"3.65"}},null,"Rtot",null,null,{"$f":"FLOOR(SUM(BV21:BV29),0.05)","v":{"v":4.1000000000000005,"d":"4.10"}},null,"Rtot",null,null,{"$f":"FLOOR(SUM(CA21:CA29),0.05)","v":{"v":4.6000000000000005,"d":"4.60"}}]
[]
[null,"d","l","R",null,null,"d","l","R",null,null,"d","l","R",null,null,"d","l","R",null,null,"d","l","R",null,null,"d","l","R",null,null,"d","l","R",null,null,"d","l","R",null,null,"d","l","R",null,null,"d","l","R",null,null,"d","l","R",null,null,"d","l","R",null,null,"d","l","R",null,null,"d","l","R",null,null,"d","l","R",null,null,"d","l","R"]
[null,"mm","W/mK","m²K/W",null,null,"mm","W/mK","m²K/W",null,null,"mm","W/mK","m²K/W",null,null,"mm","W/mK","m²K/W",null,null,"mm","W/mK","m²K/W",null,null,"mm","W/mK","m²K/W",null,null,"mm","W/mK","m²K/W",null,null,"mm","W/mK","m²K/W",null,null,"mm","W/mK","m²K/W",null,null,"mm","W/mK","m²K/W",null,null,"mm","W/mK","m²K/W",null,null,"mm","W/mK","m²K/W",null,null,"mm","W/mK","m²K/W",null,null,"mm","W/mK","m²K/W",null,null,"mm","W/mK","m²K/W",null,null,"mm","W/mK","m²K/W"]
["binnen",null,null,0.13,null,"binnen",null,null,0.13,null,"binnen",null,null,0.13,null,"binnen",null,null,0.13,null,"binnen",null,null,0.13,null,"binnen",null,null,0.13,null,"binnen",null,null,0.13,null,"binnen",null,null,0.13,null,"binnen",null,null,0.13,null,"binnen",null,null,0.13,null,"binnen",null,null,0.13,null,"binnen",null,null,0.13,null,"binnen",null,null,0.13,null,"binnen",null,null,0.13,null,"binnen",null,null,0.13,null,"binnen",null,null,0.13]
["hout",115,0.13,{"$f":"(B36/1000)/C36","v":0.8846153846153846},null,"hout",115,0.13,{"$f":"(G36/1000)/H36","v":0.8846153846153846},null,"hout",115,0.13,{"$f":"(L36/1000)/M36","v":0.8846153846153846},null,"hout",115,0.13,{"$f":"(Q36/1000)/R36","v":0.8846153846153846},null,"hout",115,0.13,{"$f":"(V36/1000)/W36","v":0.8846153846153846},null,"hout",115,0.13,{"$f":"(AA36/1000)/AB36","v":0.8846153846153846},null,"hout",115,0.13,{"$f":"(AF36/1000)/AG36","v":0.8846153846153846},null,"hout",115,0.13,{"$f":"(AK36/1000)/AL36","v":0.8846153846153846},null,"hout",136,0.13,{"$f":"(AP36/1000)/AQ36","v":1.0461538461538462},null,"hout",136,0.13,{"$f":"(AU36/1000)/AV36","v":1.0461538461538462},null,"hout",136,0.13,{"$f":"(AZ36/1000)/BA36","v":1.0461538461538462},null,"hout",136,0.13,{"$f":"(BE36/1000)/BF36","v":1.0461538461538462},null,"hout",160,0.13,{"$f":"(BJ36/1000)/BK36","v":1.2307692307692308},null,"hout",160,0.13,{"$f":"(BO36/1000)/BP36","v":1.2307692307692308},null,"hout",160,0.13,{"$f":"(BT36/1000)/BU36","v":1.2307692307692308},null,"hout",160,0.13,{"$f":"(BY36/1000)/BZ36","v":1.2307692307692308}]
["EPS HR (PolyFort)",60,0.031,{"$f":"(B37/1000)/C37","v":1.9354838709677418},null,"EPS HR (PolyFort)",79,0.031,{"$f":"(G37/1000)/H37","v":2.5483870967741935},null,"EPS HR (PolyFort)",93,0.031,{"$f":"(L37/1000)/M37","v":3},null,"EPS HR (PolyFort)",109,0.031,{"$f":"(Q37/1000)/R37","v":3.5161290322580645},null,"EPS HR (PolyFort)",60,0.031,{"$f":"(V37/1000)/W37","v":1.9354838709677418},null,"EPS HR (PolyFort)",79,0.031,{"$f":"(AA37/1000)/AB37","v":2.5483870967741935},null,"EPS HR (PolyFort)",93,0.031,{"$f":"(AF37/1000)/AG37","v":3},null,"EPS HR (PolyFort)",109,0.031,{"$f":"(AK37/1000)/AL37","v":3.5161290322580645},null,"EPS HR (PolyFort)",60,0.031,{"$f":"(AP37/1000)/AQ37","v":1.9354838709677418},null,"EPS HR (PolyFort)",79,0.031,{"$f":"(AU37/1000)/AV37","v":2.5483870967741935},null,"EPS HR (PolyFort)",93,0.031,{"$f":"(AZ37/1000)/BA37","v":3},null,"EPS HR (PolyFort)",109,0.031,{"$f":"(BE37/1000)/BF37","v":3.5161290322580645},null,"EPS HR (PolyFort)",60,0.031,{"$f":"(BJ37/1000)/BK37","v":1.9354838709677418},null,"EPS HR (PolyFort)",79,0.031,{"$f":"(BO37/1000)/BP37","v":2.5483870967741935},null,"EPS HR (PolyFort)",93,0.031,{"$f":"(BT37/1000)/BU37","v":3},null,"EPS HR (PolyFort)",109,0.031,{"$f":"(BY37/1000)/BZ37","v":3.5161290322580645}]
["folie",null,null,0,null,"folie",null,null,0,null,"folie",null,null,0,null,"folie",null,null,0,null,"folie",null,null,0,null,"folie",null,null,0,null,"folie",null,null,0,null,"folie",null,null,0,null,"folie",null,null,0,null,"folie",null,null,0,null,"folie",null,null,0,null,"folie",null,null,0,null,"folie",null,null,0,null,"folie",null,null,0,null,"folie",null,null,0,null,"folie",null,null,0]
["spouw, 30 mm licht geventileerd",null,null,0.09,null,"spouw, 30 mm licht geventileerd",null,null,0.09,null,"spouw, 30 mm licht geventileerd",null,null,0.09,null,"spouw, 30 mm licht geventileerd",null,null,0.09,null,"spouw, 30 mm licht geventileerd",null,null,0.09,null,"spouw, 30 mm licht geventileerd",null,null,0.09,null,"spouw, 30 mm licht geventileerd",null,null,0.09,null,"spouw, 30 mm licht geventileerd",null,null,0.09,null,"spouw, 30 mm licht geventileerd",null,null,0.09,null,"spouw, 30 mm licht geventileerd",null,null,0.09,null,"spouw, 30 mm licht geventileerd",null,null,0.09,null,"spouw, 30 mm licht geventileerd",null,null,0.09,null,"spouw, 30 mm licht geventileerd",null,null,0.09,null,"spouw, 30 mm licht geventileerd",null,null,0.09,null,"spouw, 30 mm licht geventileerd",null,null,0.09,null,"spouw, 30 mm licht geventileerd",null,null,0.09]
["steen",90,1.31,{"$f":"(B40/1000)/C40","v":0.06870229007633587},null,"steen",90,1.31,{"$f":"(G40/1000)/H40","v":0.06870229007633587},null,"steen",90,1.31,{"$f":"(L40/1000)/M40","v":0.06870229007633587},null,"steen",90,1.31,{"$f":"(Q40/1000)/R40","v":0.06870229007633587},null,"steen",90,1.31,{"$f":"(V40/1000)/W40","v":0.06870229007633587},null,"steen",90,1.31,{"$f":"(AA40/1000)/AB40","v":0.06870229007633587},null,"steen",90,1.31,{"$f":"(AF40/1000)/AG40","v":0.06870229007633587},null,"steen",90,1.31,{"$f":"(AK40/1000)/AL40","v":0.06870229007633587},null,"steen",90,1.31,{"$f":"(AP40/1000)/AQ40","v":0.06870229007633587},null,"steen",90,1.31,{"$f":"(AU40/1000)/AV40","v":0.06870229007633587},null,"steen",90,1.31,{"$f":"(AZ40/1000)/BA40","v":0.06870229007633587},null,"steen",90,1.31,{"$f":"(BE40/1000)/BF40","v":0.06870229007633587},null,"steen",90,1.31,{"$f":"(BJ40/1000)/BK40","v":0.06870229007633587},null,"steen",90,1.31,{"$f":"(BO40/1000)/BP40","v":0.06870229007633587},null,"steen",90,1.31,{"$f":"(BT40/1000)/BU40","v":0.06870229007633587},null,"steen",90,1.31,{"$f":"(BY40/1000)/BZ40","v":0.06870229007633587}]
["buiten",null,null,0.04,null,"buiten",null,null,0.04,null,"buiten",null,null,0.04,null,"buiten",null,null,0.04,null,"buiten",null,null,0.04,null,"buiten",null,null,0.04,null,"buiten",null,null,0.04,null,"buiten",null,null,0.04,null,"buiten",null,null,0.04,null,"buiten",null,null,0.04,null,"buiten",null,null,0.04,null,"buiten",null,null,0.04,null,"buiten",null,null,0.04,null,"buiten",null,null,0.04,null,"buiten",null,null,0.04,null,"buiten",null,null,0.04]
[]
["correctie",null,null,-0.1,null,"correctie",null,null,-0.1,null,"correctie",null,null,-0.1,null,"correctie",null,null,-0.1,null,"correctie",null,null,-0.1,null,"correctie",null,null,-0.1,null,"correctie",null,null,-0.1,null,"correctie",null,null,-0.1,null,"correctie",null,null,-0.1,null,"correctie",null,null,-0.1,null,"correctie",null,null,-0.1,null,"correctie",null,null,-0.1,null,"correctie",null,null,-0.1,null,"correctie",null,null,-0.1,null,"correctie",null,null,-0.1,null,"correctie",null,null,-0.1]
[]
["Rtot",null,null,{"$f":"FLOOR(SUM(D35:D43),0.05)","v":{"v":3,"d":"3.00"}},null,"Rtot",null,null,{"$f":"FLOOR(SUM(I35:I43),0.05)","v":3.6500000000000004},null,"Rtot",null,null,{"$f":"FLOOR(SUM(N35:N43),0.05)","v":{"v":4.1000000000000005,"d":"4.10"}},null,"Rtot",null,null,{"$f":"FLOOR(SUM(S35:S43),0.05)","v":{"v":4.6000000000000005,"d":"4.60"}},null,"Rtot",null,null,{"$f":"FLOOR(SUM(X35:X43),0.05)","v":{"v":3,"d":"3.00"}},null,"Rtot",null,null,{"$f":"FLOOR(SUM(AC35:AC43),0.05)","v":{"v":3.6500000000000004,"d":"3.65"}},null,"Rtot",null,null,{"$f":"FLOOR(SUM(AH35:AH43),0.05)","v":{"v":4.1000000000000005,"d":"4.10"}},null,"Rtot",null,null,{"$f":"FLOOR(SUM(AM35:AM43),0.05)","v":{"v":4.6000000000000005,"d":"4.60"}},null,"Rtot",null,null,{"$f":"FLOOR(SUM(AR35:AR43),0.05)","v":{"v":3.2,"d":"3.20"}},null,"Rtot",null,null,{"$f":"FLOOR(SUM(AW35:AW43),0.05)","v":{"v":3.8000000000000003,"d":"3.80"}},null,"Rtot",null,null,{"$f":"FLOOR(SUM(BB35:BB43),0.05)","v":4.25},null,"Rtot",null,null,{"$f":"FLOOR(SUM(BG35:BG43),0.05)","v":4.75},null,"Rtot",null,null,{"$f":"FLOOR(SUM(BL35:BL43),0.05)","v":3.35},null,"Rtot",null,null,{"$f":"FLOOR(SUM(BQ35:BQ43),0.05)","v":{"v":4,"d":"4.00"}},null,"Rtot",null,null,{"$f":"FLOOR(SUM(BV35:BV43),0.05)","v":4.45},null,"Rtot",null,null,{"$f":"FLOOR(SUM(CA35:CA43),0.05)","v":4.95}]
[]
[null,"d","l","R",null,null,"d","l","R",null,null,"d","l","R",null,null,"d","l","R",{"$nulls":42},"d","l","R",null,null,"d","l","R",null,null,"d","l","R",null,null,"d","l","R"]
[null,"mm","W/mK","m²K/W",null,null,"mm","W/mK","m²K/W",null,null,"mm","W/mK","m²K/W",null,null,"mm","W/mK","m²K/W",{"$nulls":42},"mm","W/mK","m²K/W",null,null,"mm","W/mK","m²K/W",null,null,"mm","W/mK","m²K/W",null,null,"mm","W/mK","m²K/W"]
["binnen",null,null,0.13,null,"binnen",null,null,0.13,null,"binnen",null,null,0.13,null,"binnen",null,null,0.13,{"$nulls":41},"binnen",null,null,0.13,null,"binnen",null,null,0.13,null,"binnen",null,null,0.13,null,"binnen",null,null,0.13]
["hout",130,0.13,{"$f":"(B50/1000)/C50","v":1},null,"hout",130,0.13,{"$f":"(G50/1000)/H50","v":1},null,"hout",130,0.13,{"$f":"(L50/1000)/M50","v":1},null,"hout",130,0.13,{"$f":"(Q50/1000)/R50","v":1},{"$nulls":41},"hout",205,0.13,{"$f":"(BJ50/1000)/BK50","v":1.5769230769230769},null,"hout",205,0.13,{"$f":"(BO50/1000)/BP50","v":1.5769230769230769},null,"hout",205,0.13,{"$f":"(BT50/1000)/BU50","v":1.5769230769230769},null,"hout",205,0.13,{"$f":"(BY50/1000)/BZ50","v":1.5769230769230769}]
["EPS HR (PolyFort)",60,0.031,{"$f":"(B51/1000)/C51","v":1.9354838709677418},null,"EPS HR (PolyFort)",79,0.031,{"$f":"(G51/1000)/H51","v":2.5483870967741935},null,"EPS HR (PolyFort)",93,0.031,{"$f":"(L51/1000)/M51","v":3},null,"EPS HR (PolyFort)",109,0.031,{"$f":"(Q51/1000)/R51","v":3.5161290322580645},{"$nulls":41},"EPS HR (PolyFort)",60,0.031,{"$f":"(BJ51/1000)/BK51","v":1.9354838709677418},null,"EPS HR (PolyFort)",79,0.031,{"$f":"(BO51/1000)/BP51","v":2.5483870967741935},null,"EPS HR (PolyFort)",93,0.031,{"$f":"(BT51/1000)/BU51","v":3},null,"EPS HR (PolyFort)",109,0.031,{"$f":"(BY51/1000)/BZ51","v":3.5161290322580645}]
["folie",null,null,0,null,"folie",null,null,0,null,"folie",null,null,0,null,"folie",null,null,0,{"$nulls":41},"folie",null,null,0,null,"folie",null,null,0,null,"folie",null,null,0,null,"folie",null,null,0]
["spouw, 30 mm licht geventileerd",null,null,0.09,null,"spouw, 30 mm licht geventileerd",null,null,0.09,null,"spouw, 30 mm licht geventileerd",null,null,0.09,null,"spouw, 30 mm licht geventileerd",null,null,0.09,{"$nulls":41},"spouw, 30 mm licht geventileerd",null,null,0.09,null,"spouw, 30 mm licht geventileerd",null,null,0.09,null,"spouw, 30 mm licht geventileerd",null,null,0.09,null,"spouw, 30 mm licht geventileerd",null,null,0.09]
["steen",90,1.31,{"$f":"(B54/1000)/C54","v":0.06870229007633587},null,"steen",90,1.31,{"$f":"(G54/1000)/H54","v":0.06870229007633587},null,"steen",90,1.31,{"$f":"(L54/1000)/M54","v":0.06870229007633587},null,"steen",90,1.31,{"$f":"(Q54/1000)/R54","v":0.06870229007633587},{"$nulls":41},"steen",90,1.31,{"$f":"(BJ54/1000)/BK54","v":0.06870229007633587},null,"steen",90,1.31,{"$f":"(BO54/1000)/BP54","v":0.06870229007633587},null,"steen",90,1.31,{"$f":"(BT54/1000)/BU54","v":0.06870229007633587},null,"steen",90,1.31,{"$f":"(BY54/1000)/BZ54","v":0.06870229007633587}]
["buiten",null,null,0.04,null,"buiten",null,null,0.04,null,"buiten",null,null,0.04,null,"buiten",null,null,0.04,{"$nulls":41},"buiten",null,null,0.04,null,"buiten",null,null,0.04,null,"buiten",null,null,0.04,null,"buiten",null,null,0.04]
[]
["correctie",null,null,-0.1,null,"correctie",null,null,-0.1,null,"correctie",null,null,-0.1,null,"correctie",null,null,-0.1,{"$nulls":41},"correctie",null,null,-0.1,null,"correctie",null,null,-0.1,null,"correctie",null,null,-0.1,null,"correctie",null,null,-0.1]
[]
["Rtot",null,null,{"$f":"FLOOR(SUM(D49:D57),0.05)","v":3.1500000000000004},null,"Rtot",null,null,{"$f":"FLOOR(SUM(I49:I57),0.05)","v":3.75},null,"Rtot",null,null,{"$f":"FLOOR(SUM(N49:N57),0.05)","v":{"v":4.2,"d":"4.20"}},null,"Rtot",null,null,{"$f":"FLOOR(SUM(S49:S57),0.05)","v":{"v":4.7,"d":"4.70"}},{"$nulls":41},"Rtot",null,null,{"$f":"FLOOR(SUM(BL49:BL57),0.05)","v":{"v":3.7,"d":"3.70"}},null,"Rtot",null,null,{"$f":"FLOOR(SUM(BQ49:BQ57),0.05)","v":{"v":4.3500000000000005,"d":"4.35"}},null,"Rtot",null,null,{"$f":"FLOOR(SUM(BV49:BV57),0.05)","v":{"v":4.800000000000001,"d":"4.80"}},null,"Rtot",null,null,{"$f":"FLOOR(SUM(CA49:CA57),0.05)","v":{"v":5.300000000000001,"d":"5.30"}}]
[]
[null,"d","l","R",null,null,"d","l","R",null,null,"d","l","R",null,null,"d","l","R",{"$nulls":42},"d","l","R",null,null,"d","l","R",null,null,"d","l","R",null,null,"d","l","R"]
[null,"mm","W/mK","m²K/W",null,null,"mm","W/mK","m²K/W",null,null,"mm","W/mK","m²K/W",null,null,"mm","W/mK","m²K/W",{"$nulls":42},"mm","W/mK","m²K/W",null,null,"mm","W/mK","m²K/W",null,null,"mm","W/mK","m²K/W",null,null,"mm","W/mK","m²K/W"]
["binnen",null,null,0.13,null,"binnen",null,null,0.13,null,"binnen",null,null,0.13,null,"binnen",null,null,0.13,{"$nulls":41},"binnen",null,null,0.13,null,"binnen",null,null,0.13,null,"binnen",null,null,0.13,null,"binnen",null,null,0.13]
["hout",136,0.13,{"$f":"(B64/1000)/C64","v":1.0461538461538462},null,"hout",136,0.13,{"$f":"(G64/1000)/H64","v":1.0461538461538462},null,"hout",136,0.13,{"$f":"(L64/1000)/M64","v":1.0461538461538462},null,"hout",136,0.13,{"$f":"(Q64/1000)/R64","v":1.0461538461538462},{"$nulls":41},"hout",250,0.13,{"$f":"(BJ64/1000)/BK64","v":1.923076923076923},null,"hout",250,0.13,{"$f":"(BO64/1000)/BP64","v":1.923076923076923},null,"hout",250,0.13,{"$f":"(BT64/1000)/BU64","v":1.923076923076923},null,"hout",250,0.13,{"$f":"(BY64/1000)/BZ64","v":1.923076923076923}]
["EPS HR (PolyFort)",60,0.031,{"$f":"(B65/1000)/C65","v":1.9354838709677418},null,"EPS HR (PolyFort)",79,0.031,{"$f":"(G65/1000)/H65","v":2.5483870967741935},null,"EPS HR (PolyFort)",93,0.031,{"$f":"(L65/1000)/M65","v":3},null,"EPS HR (PolyFort)",109,0.031,{"$f":"(Q65/1000)/R65","v":3.5161290322580645},{"$nulls":41},"EPS HR (PolyFort)",60,0.031,{"$f":"(BJ65/1000)/BK65","v":1.9354838709677418},null,"EPS HR (PolyFort)",79,0.031,{"$f":"(BO65/1000)/BP65","v":2.5483870967741935},null,"EPS HR (PolyFort)",93,0.031,{"$f":"(BT65/1000)/BU65","v":3},null,"EPS HR (PolyFort)",109,0.031,{"$f":"(BY65/1000)/BZ65","v":3.5161290322580645}]
["folie",null,null,0,null,"folie",null,null,0,null,"folie",null,null,0,null,"folie",null,null,0,{"$nulls":41},"folie",null,null,0,null,"folie",null,null,0,null,"folie",null,null,0,null,"folie",null,null,0]
["spouw, 30 mm licht geventileerd",null,null,0.09,null,"spouw, 30 mm licht geventileerd",null,null,0.09,null,"spouw, 30 mm licht geventileerd",null,null,0.09,null,"spouw, 30 mm licht geventileerd",null,null,0.09,{"$nulls":41},"spouw, 30 mm licht geventileerd",null,null,0.09,null,"spouw, 30 mm licht geventileerd",null,null,0.09,null,"spouw, 30 mm licht geventileerd",null,null,0.09,null,"spouw, 30 mm licht geventileerd",null,null,0.09]
["steen",90,1.31,{"$f":"(B68/1000)/C68","v":0.06870229007633587},null,"steen",90,1.31,{"$f":"(G68/1000)/H68","v":0.06870229007633587},null,"steen",90,1.31,{"$f":"(L68/1000)/M68","v":0.06870229007633587},null,"steen",90,1.31,{"$f":"(Q68/1000)/R68","v":0.06870229007633587},{"$nulls":41},"steen",90,1.31,{"$f":"(BJ68/1000)/BK68","v":0.06870229007633587},null,"steen",90,1.31,{"$f":"(BO68/1000)/BP68","v":0.06870229007633587},null,"steen",90,1.31,{"$f":"(BT68/1000)/BU68","v":0.06870229007633587},null,"steen",90,1.31,{"$f":"(BY68/1000)/BZ68","v":0.06870229007633587}]
["buiten",null,null,0.04,null,"buiten",null,null,0.04,null,"buiten",null,null,0.04,null,"buiten",null,null,0.04,{"$nulls":41},"buiten",null,null,0.04,null,"buiten",null,null,0.04,null,"buiten",null,null,0.04,null,"buiten",null,null,0.04]
[]
["correctie",null,null,-0.1,null,"correctie",null,null,-0.1,null,"correctie",null,null,-0.1,null,"correctie",null,null,-0.1,{"$nulls":41},"correctie",null,null,-0.1,null,"correctie",null,null,-0.1,null,"correctie",null,null,-0.1,null,"correctie",null,null,-0.1]
[]
["Rtot",null,null,{"$f":"FLOOR(SUM(D63:D71),0.05)","v":{"v":3.2,"d":"3.20"}},null,"Rtot",null,null,{"$f":"FLOOR(SUM(I63:I71),0.05)","v":{"v":3.8000000000000003,"d":"3.80"}},null,"Rtot",null,null,{"$f":"FLOOR(SUM(N63:N71),0.05)","v":4.25},null,"Rtot",null,null,{"$f":"FLOOR(SUM(S63:S71),0.05)","v":4.75},{"$nulls":41},"Rtot",null,null,{"$f":"FLOOR(SUM(BL63:BL71),0.05)","v":4.05},null,"Rtot",null,null,{"$f":"FLOOR(SUM(BQ63:BQ71),0.05)","v":{"v":4.7,"d":"4.70"}},null,"Rtot",null,null,{"$f":"FLOOR(SUM(BV63:BV71),0.05)","v":5.15},null,"Rtot",null,null,{"$f":"FLOOR(SUM(CA63:CA71),0.05)","v":5.65}]
[]
[null,"d","l","R",null,null,"d","l","R",null,null,"d","l","R",null,null,"d","l","R"]
[null,"mm","W/mK","m²K/W",null,null,"mm","W/mK","m²K/W",null,null,"mm","W/mK","m²K/W",null,null,"mm","W/mK","m²K/W"]
["binnen",null,null,0.13,null,"binnen",null,null,0.13,null,"binnen",null,null,0.13,null,"binnen",null,null,0.13]
["hout",150,0.13,{"$f":"(B78/1000)/C78","v":1.1538461538461537},null,"hout",150,0.13,{"$f":"(G78/1000)/H78","v":1.1538461538461537},null,"hout",150,0.13,{"$f":"(L78/1000)/M78","v":1.1538461538461537},null,"hout",150,0.13,{"$f":"(Q78/1000)/R78","v":1.1538461538461537}]
["EPS HR (PolyFort)",60,0.031,{"$f":"(B79/1000)/C79","v":1.9354838709677418},null,"EPS HR (PolyFort)",79,0.031,{"$f":"(G79/1000)/H79","v":2.5483870967741935},null,"EPS HR (PolyFort)",93,0.031,{"$f":"(L79/1000)/M79","v":3},null,"EPS HR (PolyFort)",109,0.031,{"$f":"(Q79/1000)/R79","v":3.5161290322580645}]
["folie",null,null,0,null,"folie",null,null,0,null,"folie",null,null,0,null,"folie",null,null,0]
["spouw, 30 mm licht geventileerd",null,null,0.09,null,"spouw, 30 mm licht geventileerd",null,null,0.09,null,"spouw, 30 mm licht geventileerd",null,null,0.09,null,"spouw, 30 mm licht geventileerd",null,null,0.09]
["steen",90,1.31,{"$f":"(B82/1000)/C82","v":0.06870229007633587},null,"steen",90,1.31,{"$f":"(G82/1000)/H82","v":0.06870229007633587},null,"steen",90,1.31,{"$f":"(L82/1000)/M82","v":0.06870229007633587},null,"steen",90,1.31,{"$f":"(Q82/1000)/R82","v":0.06870229007633587}]
["buiten",null,null,0.04,null,"buiten",null,null,0.04,null,"buiten",null,null,0.04,null,"buiten",null,null,0.04]
[]
["correctie",null,null,-0.1,null,"correctie",null,null,-0.1,null,"correctie",null,null,-0.1,null,"correctie",null,null,-0.1]
[]
["Rtot",null,null,{"$f":"FLOOR(SUM(D77:D85),0.05)","v":{"v":3.3000000000000003,"d":"3"}},null,"Rtot",null,null,{"$f":"FLOOR(SUM(I77:I85),0.05)","v":{"v":3.9000000000000004,"d":"3.90"}},null,"Rtot",null,null,{"$f":"FLOOR(SUM(N77:N85),0.05)","v":4.3500000000000005},null,"Rtot",null,null,{"$f":"FLOOR(SUM(S77:S85),0.05)","v":4.8500000000000005}]
[]
[null,"d","l","R",null,null,"d","l","R",null,null,"d","l","R",null,null,"d","l","R"]
[null,"mm","W/mK","m²K/W",null,null,"mm","W/mK","m²K/W",null,null,"mm","W/mK","m²K/W",null,null,"mm","W/mK","m²K/W"]
["binnen",null,null,0.13,null,"binnen",null,null,0.13,null,"binnen",null,null,0.13,null,"binnen",null,null,0.13]
["hout",160,0.13,{"$f":"(B92/1000)/C92","v":1.2307692307692308},null,"hout",160,0.13,{"$f":"(G92/1000)/H92","v":1.2307692307692308},null,"hout",160,0.13,{"$f":"(L92/1000)/M92","v":1.2307692307692308},null,"hout",160,0.13,{"$f":"(Q92/1000)/R92","v":1.2307692307692308}]
["EPS HR (PolyFort)",60,0.031,{"$f":"(B93/1000)/C93","v":1.9354838709677418},null,"EPS HR (PolyFort)",79,0.031,{"$f":"(G93/1000)/H93","v":2.5483870967741935},null,"EPS HR (PolyFort)",93,0.031,{"$f":"(L93/1000)/M93","v":3},null,"EPS HR (PolyFort)",109,0.031,{"$f":"(Q93/1000)/R93","v":3.5161290322580645}]
["folie",null,null,0,null,"folie",null,null,0,null,"folie",null,null,0,null,"folie",null,null,0]
["spouw, 30 mm licht geventileerd",null,null,0.09,null,"spouw, 30 mm licht geventileerd",null,null,0.09,null,"spouw, 30 mm licht geventileerd",null,null,0.09,null,"spouw, 30 mm licht geventileerd",null,null,0.09]
["steen",90,1.31,{"$f":"(B96/1000)/C96","v":0.06870229007633587},null,"steen",90,1.31,{"$f":"(G96/1000)/H96","v":0.06870229007633587},null,"steen",90,1.31,{"$f":"(L96/1000)/M96","v":0.06870229007633587},null,"steen",90,1.31,{"$f":"(Q96/1000)/R96","v":0.06870229007633587}]
["buiten",null,null,0.04,null,"buiten",null,null,0.04,null,"buiten",null,null,0.04,null,"buiten",null,null,0.04]
[]
["correctie",null,null,-0.1,null,"correctie",null,null,-0.1,null,"correctie",null,null,-0.1,null,"correctie",null,null,-0.1]
[]
["Rtot",null,null,{"$f":"FLOOR(SUM(D91:D99),0.05)","v":3.35},null,"Rtot",null,null,{"$f":"FLOOR(SUM(I91:I99),0.05)","v":{"v":4,"d":"4.00"}},null,"Rtot",null,null,{"$f":"FLOOR(SUM(N91:N99),0.05)","v":4.45},null,"Rtot",null,null,{"$f":"FLOOR(SUM(S91:S99),0.05)","v":4.95}]
[]
[null,"d","l","R",null,null,"d","l","R",null,null,"d","l","R",null,null,"d","l","R"]
[null,"mm","W/mK","m²K/W",null,null,"mm","W/mK","m²K/W",null,null,"mm","W/mK","m²K/W",null,null,"mm","W/mK","m²K/W"]
["binnen",null,null,0.13,null,"binnen",null,null,0.13,null,"binnen",null,null,0.13,null,"binnen",null,null,0.13]
["hout",166,0.13,{"$f":"(B106/1000)/C106","v":1.276923076923077},null,"hout",166,0.13,{"$f":"(G106/1000)/H106","v":1.276923076923077},null,"hout",166,0.13,{"$f":"(L106/1000)/M106","v":1.276923076923077},null,"hout",166,0.13,{"$f":"(Q106/1000)/R106","v":1.276923076923077}]
["EPS HR (PolyFort)",60,0.031,{"$f":"(B107/1000)/C107","v":1.9354838709677418},null,"EPS HR (PolyFort)",79,0.031,{"$f":"(G107/1000)/H107","v":2.5483870967741935},null,"EPS HR (PolyFort)",93,0.031,{"$f":"(L107/1000)/M107","v":3},null,"EPS HR (PolyFort)",109,0.031,{"$f":"(Q107/1000)/R107","v":3.5161290322580645}]
["folie",null,null,0,null,"folie",null,null,0,null,"folie",null,null,0,null,"folie",null,null,0]
["spouw, 30 mm licht geventileerd",null,null,0.09,null,"spouw, 30 mm licht geventileerd",null,null,0.09,null,"spouw, 30 mm licht geventileerd",null,null,0.09,null,"spouw, 30 mm licht geventileerd",null,null,0.09]
["steen",90,1.31,{"$f":"(B110/1000)/C110","v":0.06870229007633587},null,"steen",90,1.31,{"$f":"(G110/1000)/H110","v":0.06870229007633587},null,"steen",90,1.31,{"$f":"(L110/1000)/M110","v":0.06870229007633587},null,"steen",90,1.31,{"$f":"(Q110/1000)/R110","v":0.06870229007633587}]
["buiten",null,null,0.04,null,"buiten",null,null,0.04,null,"buiten",null,null,0.04,null,"buiten",null,null,0.04]
[]
["correctie",null,null,-0.1,null,"correctie",null,null,-0.1,null,"correctie",null,null,-0.1,null,"correctie",null,null,-0.1]
[]
["Rtot",null,null,{"$f":"FLOOR(SUM(D105:D113),0.05)","v":{"v":3.4000000000000004,"d":"3.40"}},null,"Rtot",null,null,{"$f":"FLOOR(SUM(I105:I113),0.05)","v":4.05},null,"Rtot",null,null,{"$f":"FLOOR(SUM(N105:N113),0.05)","v":4.5},null,"Rtot",null,null,{"$f":"FLOOR(SUM(S105:S113),0.05)","v":{"v":5,"d":"5.00"}}]
[]
[null,"d","l","R",null,null,"d","l","R",null,null,"d","l","R",null,null,"d","l","R"]
[null,"mm","W/mK","m²K/W",null,null,"mm","W/mK","m²K/W",null,null,"mm","W/mK","m²K/W",null,null,"mm","W/mK","m²K/W"]
["binnen",null,null,0.13,null,"binnen",null,null,0.13,null,"binnen",null,null,0.13,null,"binnen",null,null,0.13]
["hout",180,0.13,{"$f":"(B120/1000)/C120","v":1.3846153846153846},null,"hout",180,0.13,{"$f":"(G120/1000)/H120","v":1.3846153846153846},null,"hout",180,0.13,{"$f":"(L120/1000)/M120","v":1.3846153846153846},null,"hout",180,0.13,{"$f":"(Q120/1000)/R120","v":1.3846153846153846}]
["EPS HR (PolyFort)",60,0.031,{"$f":"(B121/1000)/C121","v":1.9354838709677418},null,"EPS HR (PolyFort)",79,0.031,{"$f":"(G121/1000)/H121","v":2.5483870967741935},null,"EPS HR (PolyFort)",93,0.031,{"$f":"(L121/1000)/M121","v":3},null,"EPS HR (PolyFort)",109,0.031,{"$f":"(Q121/1000)/R121","v":3.5161290322580645}]
["folie",null,null,0,null,"folie",null,null,0,null,"folie",null,null,0,null,"folie",null,null,0]
["spouw, 30 mm licht geventileerd",null,null,0.09,null,"spouw, 30 mm licht geventileerd",null,null,0.09,null,"spouw, 30 mm licht geventileerd",null,null,0.09,null,"spouw, 30 mm licht geventileerd",null,null,0.09]
["steen",90,1.31,{"$f":"(B124/1000)/C124","v":0.06870229007633587},null,"steen",90,1.31,{"$f":"(G124/1000)/H124","v":0.06870229007633587},null,"steen",90,1.31,{"$f":"(L124/1000)/M124","v":0.06870229007633587},null,"steen",90,1.31,{"$f":"(Q124/1000)/R124","v":0.06870229007633587}]
["buiten",null,null,0.04,null,"buiten",null,null,0.04,null,"buiten",null,null,0.04,null,"buiten",null,null,0.04]
[]
["correctie",null,null,-0.1,null,"correctie",null,null,-0.1,null,"correctie",null,null,-0.1,null,"correctie",null,null,-0.1]
[]
["Rtot",null,null,{"$f":"FLOOR(SUM(D119:D127),0.05)","v":{"v":3.5,"d":"3.50"}},null,"Rtot",null,null,{"$f":"FLOOR(SUM(I119:I127),0.05)","v":4.15},null,"Rtot",null,null,{"$f":"FLOOR(SUM(N119:N127),0.05)","v":{"v":4.6000000000000005,"d":"4.60"}},null,"Rtot",null,null,{"$f":"FLOOR(SUM(S119:S127),0.05)","v":{"v":5.1000000000000005,"d":"5.10"}}]

{"sheet":"Gesch","index":6,"n_rows":12,"n_cols":3,"rows_kept":12,"hidden":true}
["2006-09-11",null,"Binnenspouwbladen ingevoerd"]
["2006-11-10",null,"Lay-out afgewerkt en Franstalige versie toegevoegd, incl taalkeuzeknop"]
["2006-10-17",null,"Franse vertaling toegevoegd"]
["2007-01-15",null,"Alleen in NL versie t.b.v. project NB 80 mm beton binnenspouwblad ingevoerd."]
["2007-02-01",null,"Ook Franse versie 80 mm Beton binnenspouwblad ingevoerd; lay out gestoomlijnd"]
["2007-04-16",null,"Werkblad standaardconstructie en dikte 60 mm toegevoegd"]
["2008-06-04",null,"Dikten 79, 93 en 109 mm toegevoegd"]
["2008-06-16",null,"Vrije dikten 30 - 100 mm en alufolie bij Contr conc toegevoegd"]
["2008-10-30",null,"Decker toegevoegd"]
["2009-02-20",null,"Vergelijk t.b.v. brochures toegevoegd"]
["2009-02-26",null,"Lambda 0,036 voor XPS (≥ 60 mm dik) toegevoegd"]
["2009-08-12",null,"Diverse PURren toegevoegd (t.b.v.Contr conc.)"]

{"sheet":"Sheet1","index":7,"n_rows":0,"n_cols":0,"rows_kept":0,"hidden":true}